Ontology Visualization Benchmark (OntoViBe)
type: Ontology
version info: 2.2
version IRI: http://ontovibe.visualdataweb.org/2.2
imports: imported
prior version: http://ontovibe.visualdataweb.org/2.1
backward compatible with: http://ontovibe.visualdataweb.org/2.1
incompatible with: minimal
comment: OntoViBe is a benchmark for testing ontology visualizations. It incorporates a comprehensive set of OWL 2 language constructs and systematic combinations thereof.
creator: Florian Haag
creator: Steffen Lohmann
contributor: Stefan Negru
date: 2015-08-27
rights: http://creativecommons.org/licenses/by/4.0/

DeprecatedClass
type: Class
deprecated: true

UnionClass
type: Class
comment: This is an English comment on a class expression.
equivalent class: Class
  union of: Class1
  union of: DeprecatedClass

PropertyOwner
type: Class
type: PropertyOwnerType
subclass of:
  on property: customTypeDatatypeProperty
  cardinality: 2
subclass of:
  on property: dummyProperty
  min qualified cardinality: 3
  on class: Subclass
subclass of:
  on property: classToClassProperty
  cardinality: 3

multi-property owner
type: Class
type: PropertyOwnerType
comment: This is a comment without a language-tag on a class that also has a label.

disjoint class
type: Class
disjoint with: LargeUnionClass
label: disjunkte Klasse @de
subclass of:
  on property: oppositeDummyProperty
  min cardinality: 5
subclass of:
  on property: oppositeDummyProperty
  max cardinality: 15

MultiSubclass
type: Class
subclass of: disjoint class
subclass of: DeprecatedImportedClass
comment: This is an English comment on a class that also has a description.
description: This is an English description on a class that also has a comment.

HasSelfClass
type: Class
subclass of: Restriction
  on property: classToClassProperty
  has self: true

EquivalentDeprecatedClass
type: Class
deprecated: true
description: This is an English description in a class that is part of an equivalent class group.

EquivalentDeprecatedClassInLargeGroup
type: Class
deprecated: true

MultiSubclassIndividual1
type: MultiSubclass
comment: This ia an English comment on an individual.

MultiSubclassIndividual3
type: MultiSubclass
different from: MultiSubclassIndividual2
dummy property: MultiSubclassIndividual1
complement-type datatype property: 19
description: This is a description without a language on an individual.

AnotherIndividual
type: DeprecatedClass
comment: This is an English comment on an individual that also has a description.
description: This is an English description on an individual that also has a comment.

NegativePropertyAssertion
source individual: MultiSubclassIndividual2
assertion property: complement-type datatype property
target value: 18

DivisibleByTwoEnumeration
type: Datatype
equivalent class: Datatype
  one of: 2
  one of: 4
  one of: 6
  one of: 8
  one of: 10
  one of: 12
  one of: 14
  one of: 16
  one of: 18
  one of: 20

DivisibleByFiveEnumeration
type: Datatype
equivalent class: Datatype
  one of: 5
  one of: 10
  one of: 15
  one of: 20

unionTypeDatatypeProperty
type: DatatypeProperty
domain: PropertyOwner
range: UnionDatatype
comment: This is an English comment on a property.

complement-type datatype property
type: DatatypeProperty
domain: PropertyOwner
range: ComplementDatatype

imported type datatype property
type: DatatypeProperty
domain: PropertyOwner
range: DivisibleByThreeEnumeration
label: propriété d'un type de données importé @fr
label: 一种导入类型的数据类型性质 @zh-hans

classToClassProperty
type: ObjectProperty
domain: PropertyOwner
range: Class1
description: Esto es una descripción en español de una propiedad con descripciones en varias lenguas. @es
description: This is an English description of a property with descriptions in several languages.

Restriction
on property: cyclicProperty1
has self: true

cyclicProperty2
type: ReflexiveProperty
domain: multi-property owner
range: multi-property owner
comment: This is an English comment on a property that also has a non-English description.
description: Dies ist eine deutsche Beschreibung einer Eigenschaft, die auch einen nicht in Deutsch verfassten Kommentar enthält. @de

deprecatedDatatypeProperty
type: DatatypeProperty
deprecated: true
domain: PropertyOwner
range: date

deprecatedObjectProperty
type: ObjectProperty
deprecated: true
domain: PropertyOwner
range: Thing